BDBM50441013 CHEMBL2430146::US9732037, Compound 16
SMILES Cc1cc(N)nc(COC[C@H](CCN)OCc2cc(C)cc(N)n2)c1
InChI Key InChIKey=BXQXCGJXAWOXHN-INIZCTEOSA-N
Data  6 KI
  Tab Delimited (TSV)   2D SDfile   Computed 3D by Vconf -m prep SDfile
Find this compound or compounds like it in BindingDB:
Activity Spreadsheet -- Enzyme Inhibition Constant Data from BindingDB
Found 6 hits for monomerid = 50441013
TargetNitric oxide synthase, brain(Rattus norvegicus (rat))
Northwestern University
Curated by ChEMBL
LigandPNGBDBM50441013(CHEMBL2430146 | US9732037, Compound 16)
Affinity DataKi:  1.60E+3nM. Assay description: Inhibition of rat recombinant nNOS expressed in Escherichia coli using L-arginine as substrate up to 180 seconds by hemoglobin capture assay
In DepthDetails ArticlePubMed
TargetNitric oxide synthase, brain(Homo sapiens (Human))
Northwestern University
US Patent
LigandPNGBDBM50441013(CHEMBL2430146 | US9732037, Compound 16)
Affinity DataKi:  1.60E+3nM. Assay description: NOS inhibition assays of representative compounds 1-21 were undertaken, and the results are summarized in Table 1, below. All NOS isoforms were expre...
In DepthDetails US Patent
TargetNitric oxide synthase, inducible(Homo sapiens (Human))
Northwestern University
US Patent
LigandPNGBDBM50441013(CHEMBL2430146 | US9732037, Compound 16)
Affinity DataKi:  5.28E+4nM. Assay description: NOS inhibition assays of representative compounds 1-21 were undertaken, and the results are summarized in Table 1, below. All NOS isoforms were expre...
In DepthDetails US Patent
TargetNitric oxide synthase, inducible(Mus musculus (mouse))
Northwestern University
Curated by ChEMBL
LigandPNGBDBM50441013(CHEMBL2430146 | US9732037, Compound 16)
Affinity DataKi:  5.32E+4nM. Assay description: Inhibition of mouse recombinant iNOS expressed in Escherichia coli using L-arginine as substrate up to 180 seconds by hemoglobin capture assay
In DepthDetails ArticlePubMed
TargetNitric oxide synthase, endothelial(Homo sapiens (Human))
Northwestern University
US Patent
LigandPNGBDBM50441013(CHEMBL2430146 | US9732037, Compound 16)
Affinity DataKi:  9.27E+4nM. Assay description: NOS inhibition assays of representative compounds 1-21 were undertaken, and the results are summarized in Table 1, below. All NOS isoforms were expre...
In DepthDetails US Patent
TargetNitric oxide synthase, endothelial(Bos taurus (bovine))
Northwestern University
Curated by ChEMBL
LigandPNGBDBM50441013(CHEMBL2430146 | US9732037, Compound 16)
Affinity DataKi:  9.28E+4nM. Assay description: Inhibition of bovine recombinant eNOS expressed in Escherichia coli using L-arginine as substrate up to 180 seconds by hemoglobin capture assay
In DepthDetails ArticlePubMed