BDBM50443415 CHEMBL3086835
SMILES Cc1c(n2ccccc2[n+]1CCCc1ccccc1)P(=S)(c1ccccc1)c1ccccc1
InChI Key InChIKey=USPDKVPYKLGKGY-UHFFFAOYSA-N
Data  1 IC50
  Tab Delimited (TSV)   2D SDfile   Computed 3D by Vconf -m prep SDfile
Find this compound or compounds like it in BindingDB:
Activity Spreadsheet -- Enzyme Inhibition Constant Data from BindingDB
Found 1 hit for monomerid = 50443415
TargetNeuropeptide S receptor(Homo sapiens (Human))
National Institutes Of Health
Curated by ChEMBL
LigandPNGBDBM50443415(CHEMBL3086835)
Affinity DataIC50:  110nM. Assay description: Antagonist activity at neuropeptide S receptor (unknown origin) expressed in CHO cells assessed as cAMP level after 30 mins by phosphate-buffered sal...
In DepthDetails ArticlePubMed