BDBM50443796 CHEMBL3094229
SMILES O=C1C(NCCCCCCCS(=O)(=O)N(OCCN2CCOCC2)C2CCCCC2)C(Nc2ccncc2)C1=O
InChI Key InChIKey=BFGBVYSWKXGMCJ-UHFFFAOYSA-N
Data  1 IC50
  Tab Delimited (TSV)   2D SDfile   Computed 3D by Vconf -m prep SDfile
Find this compound or compounds like it in BindingDB:
Activity Spreadsheet -- Enzyme Inhibition Constant Data from BindingDB
Found 1 hit for monomerid = 50443796
TargetNicotinamide phosphoribosyltransferase(Homo sapiens (Human))
Topotarget
Curated by ChEMBL
LigandPNGBDBM50443796(CHEMBL3094229)
Affinity DataIC50:  3.60nM. Assay description: Inhibition of NAMPT in human HepG2 cells using [14C]-nicotinamide/PRPP as substrate assessed as formation of [14C]-nicotinamide mononucleotide after ...
In DepthDetails ArticlePubMed