BDBM50443801 CHEMBL3094254
SMILES O=S(=O)(CCCCCCNC(NC#N)=Nc1ccncc1)NOCC1CCCCC1
InChI Key InChIKey=WWYUTYWDWTTWRM-UHFFFAOYSA-N
Data  1 IC50
  Tab Delimited (TSV)   2D SDfile   Computed 3D by Vconf -m prep SDfile
Find this compound or compounds like it in BindingDB:
Activity Spreadsheet -- Enzyme Inhibition Constant Data from BindingDB
Found 1 hit for monomerid = 50443801
TargetNicotinamide phosphoribosyltransferase(Homo sapiens (Human))
Topotarget
Curated by ChEMBL
LigandPNGBDBM50443801(CHEMBL3094254)
Affinity DataIC50:  2.40nM. Assay description: Inhibition of NAMPT in human HepG2 cells using [14C]-nicotinamide/PRPP as substrate assessed as formation of [14C]-nicotinamide mononucleotide after ...
In DepthDetails ArticlePubMed