BDBM50444500 CHEMBL3092834
SMILES Cc1nnc(o1)-c1ccc(Oc2ccc3CCN(CCc3c2)C2CCC2)nc1
InChI Key InChIKey=FAIJKKWPAFUWJG-UHFFFAOYSA-N
Data  1 KI
  Tab Delimited (TSV)   2D SDfile   Computed 3D by Vconf -m prep SDfile
Find this compound or compounds like it in BindingDB:
Activity Spreadsheet -- Enzyme Inhibition Constant Data from BindingDB
Found 1 hit for monomerid = 50444500
TargetHistamine H3 receptor(Rattus norvegicus (rat))
Glaxosmithkline
Curated by ChEMBL
LigandPNGBDBM50444500(CHEMBL3092834)
Affinity DataKi:  0.501nM. Assay description: Displacement of [3H]-R-alpha-ethylhistamine from histamine H3 receptor in rat cerebral cortical tissue membranes after 45 mins by liquid scintillatio...
In DepthDetails ArticlePubMed