BDBM50444511 CHEMBL3092838
SMILES Cc1nc(Oc2ccc3CCN(CCc3c2)C2CCC2)ccc1C#N
InChI Key InChIKey=OKLSHSUVFJAFAO-UHFFFAOYSA-N
Data  1 KI
  Tab Delimited (TSV)   2D SDfile   Computed 3D by Vconf -m prep SDfile
Find this compound or compounds like it in BindingDB:
Activity Spreadsheet -- Enzyme Inhibition Constant Data from BindingDB
Found 1 hit for monomerid = 50444511
TargetHistamine H3 receptor(Rattus norvegicus (rat))
Glaxosmithkline
Curated by ChEMBL
LigandPNGBDBM50444511(CHEMBL3092838)
Affinity DataKi:  4nM. Assay description: Displacement of [3H]-R-alpha-ethylhistamine from histamine H3 receptor in rat cerebral cortical tissue membranes after 45 mins by liquid scintillatio...
In DepthDetails ArticlePubMed