BDBM50444910 CHEMBL3099677
SMILES CO[C@@H]1C[C@@H]2[C@@H](COP(O)(O)=O)[C@H]([C@H](N2C1)c1ccc2ccccc2c1)C(=O)NCc1ccccc1
InChI Key InChIKey=REHOFSAWFKHSIJ-ZFXZZAOISA-N
Data  1 KI
  Tab Delimited (TSV)   2D SDfile   Computed 3D by Vconf -m prep SDfile
Find this compound or compounds like it in BindingDB:
Activity Spreadsheet -- Enzyme Inhibition Constant Data from BindingDB
Found 1 hit for monomerid = 50444910
TargetPeptidyl-prolyl cis-trans isomerase NIMA-interacting 1(Homo sapiens (Human))
Beni-Suef University
Curated by ChEMBL
LigandPNGBDBM50444910(CHEMBL3099677)
Affinity DataKi:  9.00E+3nM. Assay description: Inhibition of Pin-1 (unknown origin) using Suc-Ala-Glu-Pro-Phe-pNA as substrate preincubated for 300 seconds followed by substrate addition by UV/Vis...
In DepthDetails ArticlePubMed