BDBM50444912 CHEMBL3099732
SMILES OP(O)(=O)OCC1C2CCCN2C(C1C(=O)NCc1ccc2OCOc2c1)c1ccc2ccccc2c1
InChI Key InChIKey=GZRBPSILZAGQEV-UHFFFAOYSA-N
Data  1 KI
  Tab Delimited (TSV)   2D SDfile   Computed 3D by Vconf -m prep SDfile
Find this compound or compounds like it in BindingDB:
Activity Spreadsheet -- Enzyme Inhibition Constant Data from BindingDB
Found 1 hit for monomerid = 50444912
TargetPeptidyl-prolyl cis-trans isomerase NIMA-interacting 1(Homo sapiens (Human))
Beni-Suef University
Curated by ChEMBL
LigandPNGBDBM50444912(CHEMBL3099732)
Affinity DataKi:  3.20E+4nM. Assay description: Inhibition of Pin-1 (unknown origin) using Suc-Ala-Glu-Pro-Phe-pNA as substrate preincubated for 300 seconds followed by substrate addition by UV/Vis...
In DepthDetails ArticlePubMed