BDBM50447206 CHEMBL3113188::US10752581, Compound 58
SMILES COc1cccc(CNc2ccc(cc2)S(=O)(=O)Nc2ccccn2)c1O
InChI Key InChIKey=WPSFPRGJZJKOLP-UHFFFAOYSA-N
Data  2 IC50
  Tab Delimited (TSV)   2D SDfile   Computed 3D by Vconf -m prep SDfile
Find this compound or compounds like it in BindingDB:
Activity Spreadsheet -- Enzyme Inhibition Constant Data from BindingDB
Found 2 hits for monomerid = 50447206
TargetPolyunsaturated fatty acid lipoxygenase ALOX12(Homo sapiens (Human))
Eastern Virginia Medical School
US Patent
LigandPNGBDBM50447206(CHEMBL3113188 | US10752581, Compound 58)
Affinity DataIC50:  5.00E+3nM. Assay description: UV-vis cuvette-based assay.
In DepthDetails US Patent
TargetPolyunsaturated fatty acid lipoxygenase ALOX12(Homo sapiens (Human))
Eastern Virginia Medical School
US Patent
LigandPNGBDBM50447206(CHEMBL3113188 | US10752581, Compound 58)
Affinity DataIC50:  5.00E+3nM. Assay description: Inhibition of N-terminal His6-tagged human platelet 12-LOX using arachidonic acid as substrate by UV-vis spectrophotometric analysis
In DepthDetails ArticlePubMed