BDBM50450697 CHEMBL4176794
SMILES C[C@H](Nc1ncnc(N)c1-c1ccc(O)c(F)c1)c1nn2ccc(C)c2c(=O)n1-c1ccccc1
InChI Key InChIKey=IZHWRLKLKIUFPI-HNNXBMFYSA-N
Data  5 IC50
  Tab Delimited (TSV)   2D SDfile   Computed 3D by Vconf -m prep SDfile
Find this compound or compounds like it in BindingDB:
Activity Spreadsheet -- Enzyme Inhibition Constant Data from BindingDB
Found 5 hits for monomerid = 50450697
LigandPNGBDBM50450697(CHEMBL4176794)
Affinity DataIC50:  87nM. Assay description: Inhibition of recombinant human N-terminal His6-tagged full length p110beta/recombinant human full length p85alpha using PIP2 as substrate preincubat...
Ligand InfoPC cidPC sid
In DepthDetails ArticlePubMed
LigandPNGBDBM50450697(CHEMBL4176794)
Affinity DataIC50:  1.10E+3nM. Assay description: Inhibition of recombinant human N-terminal His6-tagged full length p110alpha/recombinant human full length p85alpha using PIP2 as substrate preincuba...
Ligand InfoPC cidPC sid
In DepthDetails ArticlePubMed
LigandPNGBDBM50450697(CHEMBL4176794)
Affinity DataIC50:  4.40nM. Assay description: Inhibition of PI3Kdelta in human THP-1 cells assessed as reduction in M-CSF-stimulated AKT phosphorylation at Thr308 preincubated for 30 mins followe...
Ligand InfoPC cidPC sid
In DepthDetails ArticlePubMed
LigandPNGBDBM50450697(CHEMBL4176794)
Affinity DataIC50:  0.5nM. Assay description: Inhibition of recombinant human N-terminal His-tagged full length p110delta/recombinant human full length p85alpha using PIP2 as substrate preincubat...
Ligand InfoPC cidPC sid
In DepthDetails ArticlePubMed
LigandPNGBDBM50450697(CHEMBL4176794)
Affinity DataIC50:  11nM. Assay description: Inhibition of recombinant human N-terminal His6-tagged full length p110gamma using PIP2 as substrate preincubated for 30 mins followed by substrate a...
Ligand InfoPC cidPC sid
In DepthDetails ArticlePubMed