BDBM50451055 CHEMBL4205290
SMILES COc1ccccc1N1CCN(CCNC(=O)c2ccccn2)CC1
InChI Key InChIKey=ARQDTTRYUMUINH-UHFFFAOYSA-N
Data  5 KI  1 EC50
  Tab Delimited (TSV)   2D SDfile   Computed 3D by Vconf -m prep SDfile
Find this compound or compounds like it in BindingDB:
Activity Spreadsheet -- Enzyme Inhibition Constant Data from BindingDB
Found 6 hits for monomerid = 50451055
Target5-hydroxytryptamine receptor 2A(Rattus norvegicus (rat))
Dipartimento Di Farmacia Universit£
Curated by ChEMBL
LigandPNGBDBM50451055(CHEMBL4205290)
Affinity DataKi:  0.0224nM. Assay description: Displacement of [3H]ketanserin from serotonin 5-HT2A receptor in Sprague-Dawley rat brain cortex homogenates incubated for 15 mins by liquid scintill...
Ligand InfoPC cidPC sid
In DepthDetails ArticlePubMed
Target5-hydroxytryptamine receptor 1A(Homo sapiens (Human))
Beijing Normal University
Curated by ChEMBL
LigandPNGBDBM50451055(CHEMBL4205290)
Affinity DataKi:  7.70nM. Assay description: Binding affinity to 5-HT1A receptor (unknown origin) assessed as inhibition constant
Ligand InfoPC cidPC sid
In DepthDetails PubMed
TargetAlpha-1A adrenergic receptor(Homo sapiens (Human))
Beijing Normal University
Curated by ChEMBL
LigandPNGBDBM50451055(CHEMBL4205290)
Affinity DataKi:  20nM. Assay description: Binding affinity to alpha 1A adrenergic receptor (unknown origin) assessed as inhibition constant
Ligand InfoPC cidPC sid
In DepthDetails PubMed
Target5-hydroxytryptamine receptor 1A(Rattus norvegicus (rat))
Dipartimento Di Farmacia Universit£
Curated by ChEMBL
LigandPNGBDBM50451055(CHEMBL4205290)
Affinity DataKi:  599nM. Assay description: Displacement of [3H]-8-OH-DPAT from serotonin 5-HT1A receptor in Sprague-Dawley rat brain cortex homogenates incubated for 30 mins by liquid scintill...
Ligand InfoPC cidPC sid
In DepthDetails ArticlePubMed
Target5-hydroxytryptamine receptor 2C(Rattus norvegicus (Rat))
Dipartimento Di Farmacia Universit£
Curated by ChEMBL
LigandPNGBDBM50451055(CHEMBL4205290)
Affinity DataKi: >1.00E+4nM. Assay description: Displacement of [3H]mesulergine from serotonin 5-HT2C receptor in Sprague-Dawley rat brain cortex homogenates incubated for 15 mins by liquid scintil...
Ligand InfoPC cidPC sid
In DepthDetails ArticlePubMed
Target5-hydroxytryptamine receptor 2A(Rattus norvegicus (rat))
Dipartimento Di Farmacia Universit£
Curated by ChEMBL
LigandPNGBDBM50451055(CHEMBL4205290)
Affinity DataEC50:  4.25E+3nM. Assay description: Antagonist activity at 5-HT2A receptor in Sprague-Dawley rat ielum assessed as reduction in 5-HT-evoked contraction
Ligand InfoPC cidPC sid
In DepthDetails ArticlePubMed