BDBM50451436 CHEMBL2112287
SMILES COc1cccc2c(cn(CCN3CCOCC3)c12)C(=O)N[C@@H]1C2(C)CCC(C2)C1(C)C
InChI Key InChIKey=VQGDMQICNRCQEH-OUXPZVHUSA-N
Data  1 KI
  Tab Delimited (TSV)   2D SDfile   Computed 3D by Vconf -m prep SDfile
Find this compound or compounds like it in BindingDB:
Activity Spreadsheet -- Enzyme Inhibition Constant Data from BindingDB
Found 1 hit for monomerid = 50451436
TargetCannabinoid receptor 2(Homo sapiens (Human))
Bristol-Myers Squibb
Curated by ChEMBL
LigandPNGBDBM50451436(CHEMBL2112287)
Affinity DataKi:  13nM. Assay description: Binding affinity against human CB2 receptor expressed in CHO cells by using WIN55,2122 Mesylate [5,73H] as Radioactive tracer
In DepthDetails ArticlePubMed