BDBM50452464 CHEMBL4212125
SMILES CC(C)NC(=O)N[C@H]1CC[C@H](CC1)Nc1nc(N[C@H](C)CO)nc2ccc(cc12)-c1cccc(F)c1
InChI Key InChIKey=ATZLHDZWWHBJEQ-YHYVQYDKSA-N
Data  2 EC50
  Tab Delimited (TSV)   2D SDfile   Computed 3D by Vconf -m prep SDfile
Find this compound or compounds like it in BindingDB:
Activity Spreadsheet -- Enzyme Inhibition Constant Data from BindingDB
Found 2 hits for monomerid = 50452464
TargetAtrial natriuretic peptide receptor 1(Homo sapiens (Human))
Asubio Pharma
Curated by ChEMBL
LigandPNGBDBM50452464(CHEMBL4212125)
Affinity DataEC50:  320nM. Assay description: Agonist activity at human NPR-A expressed in CHO cells assessed as increase in cGMP accumulation after 30 mins by radioimmunoassay
Ligand InfoPC cidPC sid
In DepthDetails ArticlePubMed
TargetAtrial natriuretic peptide receptor 1(Rattus norvegicus)
Asubio Pharma
Curated by ChEMBL
LigandPNGBDBM50452464(CHEMBL4212125)
Affinity DataEC50:  74nM. Assay description: Agonist activity at rat NPR-A expressed in CHO cells assessed as increase in cGMP accumulation after 15 mins by fluorescent assay
Ligand InfoPC cidPC sid
In DepthDetails ArticlePubMed