BDBM50454863 CHEMBL4206352
SMILES COc1ccc(O[C@@H]2O[C@H](COC(=O)CCC(F)(F)C(F)(F)C(F)(F)C(F)(F)C(F)(F)C(F)(F)C(F)(F)C(F)(F)F)[C@@H](O[C@@H]3O[C@H](COS(O)(=O)=O)[C@@H](OS(O)(=O)=O)[C@H](OC(=O)CCC(C)=O)[C@H]3N3C(=O)c4ccccc4C3=O)[C@H](OCc3ccccc3)[C@H]2OC(=O)c2ccccc2)cc1
InChI Key InChIKey=WSZFCLKSWLRRSC-JXKLQUETSA-N
Data  1 IC50
  Tab Delimited (TSV)   2D SDfile   Computed 3D by Vconf -m prep SDfile
Find this compound or compounds like it in BindingDB:
Activity Spreadsheet -- Enzyme Inhibition Constant Data from BindingDB
Found 1 hit for monomerid = 50454863
TargetMidkine(Homo sapiens (Human))
Csic And Universidad De Sevilla
Curated by ChEMBL
LigandPNGBDBM50454863(CHEMBL4206352)
Affinity DataIC50:  396nM. Assay description: Inhibition of fluorescein labelled heparin-like hexasaccharide probe binding to recombinant human midkine after 5 mins by fluorescence polarization a...
Ligand InfoKEGGPC cidPC sid
In DepthDetails ArticlePubMed