BDBM50454867 CHEMBL4207050
SMILES COc1ccc(O[C@@H]2O[C@H](CO)[C@@H](O[C@@H]3O[C@H](COS(O)(=O)=O)[C@@H](OS(O)(=O)=O)[C@H](O)[C@H]3NC(C)=O)[C@H](OCc3ccccc3)[C@H]2O)cc1
InChI Key InChIKey=IPUMADZUGBBAIF-QLJCWTAQSA-N
Data  1 IC50
  Tab Delimited (TSV)   2D SDfile   Computed 3D by Vconf -m prep SDfile
Find this compound or compounds like it in BindingDB:
Activity Spreadsheet -- Enzyme Inhibition Constant Data from BindingDB
Found 1 hit for monomerid = 50454867
TargetMidkine(Homo sapiens (Human))
Csic And Universidad De Sevilla
Curated by ChEMBL
LigandPNGBDBM50454867(CHEMBL4207050)
Affinity DataIC50: >2.50E+5nM. Assay description: Inhibition of fluorescein labelled heparin-like hexasaccharide probe binding to recombinant human midkine after 5 mins by fluorescence polarization a...
Ligand InfoKEGGPC cidPC sid
In DepthDetails ArticlePubMed