BDBM50455564 CHEMBL4211820
SMILES NCc1cccc(c1)-n1cnc2ccc(cc12)-c1ccnc2[nH]ccc12
InChI Key InChIKey=BDEDKVDHVVWZKG-UHFFFAOYSA-N
Data  1 IC50
  Tab Delimited (TSV)   2D SDfile   Computed 3D by Vconf -m prep SDfile
Find this compound or compounds like it in BindingDB:
Activity Spreadsheet -- Enzyme Inhibition Constant Data from BindingDB
Found 1 hit for monomerid = 50455564
TargetProtein kinase C iota type(Homo sapiens (Human))
Agency For Science, Technology And Research (A*Star)
Curated by ChEMBL
LigandPNGBDBM50455564(CHEMBL4211820)
Affinity DataIC50:  1.10E+3nM. Assay description: Inhibition of full-length N-terminal GST-fused human PKC-iota expressed in baculovirus expression system using (5FAM) RFARKGSLRQKNV as substrate afte...
Ligand InfoPC cidPC sid
In DepthDetails ArticlePubMed