BDBM50456146 CHEMBL4206847
SMILES COCCCN1CCC(CNC(=O)c2cccc3cc(nn23)C(C)C)CC1
InChI Key InChIKey=XFIBLFNUBRPOJC-UHFFFAOYSA-N
Data  1 EC50
  Tab Delimited (TSV)   2D SDfile   Computed 3D by Vconf -m prep SDfile
Find this compound or compounds like it in BindingDB:
Activity Spreadsheet -- Enzyme Inhibition Constant Data from BindingDB
Found 1 hit for monomerid = 50456146
Target5-hydroxytryptamine receptor 4(Homo sapiens (Human))
Suven Life Sciences
Curated by ChEMBL
LigandPNGBDBM50456146(CHEMBL4206847)
Affinity DataEC50:  0.300nM. Assay description: Agonist activity at recombinant human 5-HT4E receptor expressed in CHO cells assessed as induction of c-AMP accumulation after 4 hrs by luciferase re...
Ligand InfoPC cidPC sid
In DepthDetails ArticlePubMed