BDBM50458147 CHEMBL4204891
SMILES [H][C@]12Cc3ccc(O)cc3[C@@](C)(CCN1CCC#N)[C@H]2C
InChI Key InChIKey=DHJAHFWTVDJKOO-VUCTXSBTSA-N
Data  3 KI
  Tab Delimited (TSV)   2D SDfile   Computed 3D by Vconf -m prep SDfile
Find this compound or compounds like it in BindingDB:
Activity Spreadsheet -- Enzyme Inhibition Constant Data from BindingDB
Found 3 hits for monomerid = 50458147
TargetKappa-type opioid receptor(Macaca mulatta)
University Of Catania
Curated by ChEMBL
LigandPNGBDBM50458147(CHEMBL4204891)
Affinity DataKi:  0.400nM. Assay description: Displacement of [3H]U69,593 from KOR in monkey brain cortex membranes
Ligand InfoPC cidPC sid
In DepthDetails ArticlePubMed
TargetOpioid receptor delta 1(Macaca mulatta)
University Of Catania
Curated by ChEMBL
LigandPNGBDBM50458147(CHEMBL4204891)
Affinity DataKi:  4.20nM. Assay description: Displacement of [3H]naltrindole from DOR in monkey brain cortex membranes
Ligand InfoPC cidPC sid
In DepthDetails ArticlePubMed
TargetMu-type opioid receptor(Macaca mulatta)
University Of Catania
Curated by ChEMBL
LigandPNGBDBM50458147(CHEMBL4204891)
Affinity DataKi:  9.80nM. Assay description: Displacement of [3H]DAMGO from MOR in monkey brain cortex membranes
Ligand InfoPC cidPC sid
In DepthDetails ArticlePubMed