BDBM50459014 CHEMBL4212961
SMILES C[C@H](Nc1c(nnc2ccc(cc12)-c1ccc(OCCCN(C)C)nc1)C(N)=O)c1nn(C)cc1C
InChI Key InChIKey=CFNSOLJHFSOKTJ-KRWDZBQOSA-N
Data  2 IC50
  Tab Delimited (TSV)   2D SDfile   Computed 3D by Vconf -m prep SDfile
Find this compound or compounds like it in BindingDB:
Activity Spreadsheet -- Enzyme Inhibition Constant Data from BindingDB
Found 2 hits for monomerid = 50459014
TargetSerine/threonine-protein kinase ATR(Homo sapiens (Human))
Astrazeneca
Curated by ChEMBL
LigandPNGBDBM50459014(CHEMBL4212961)
Affinity DataIC50: >3.00E+4nM. Assay description: Inhibition of ATR in human HT-29 cells measured after 1 hr by Hoechst 33258 staining based fluorescence assay
Ligand InfoPC cidPC sid
In DepthDetails ArticlePubMed
TargetSerine-protein kinase ATM(Homo sapiens (Human))
Astrazeneca
Curated by ChEMBL
LigandPNGBDBM50459014(CHEMBL4212961)
Affinity DataIC50:  0.900nM. Assay description: Inhibition of ATM autophosphorylation at Ser1981 residue in human HT-29 cells measured after 1 hr by Hoechst staining based fluorescence assay
Ligand InfoPC cidPC sid
In DepthDetails ArticlePubMed