BDBM50459401 CHEMBL4210854
SMILES O=C(N1CCCCc2ccccc12)c1ccc(cc1)-c1ccccc1
InChI Key InChIKey=RIBXPGIEMRBUDS-UHFFFAOYSA-N
Data  3 KI
  Tab Delimited (TSV)   2D SDfile   Computed 3D by Vconf -m prep SDfile
Find this compound or compounds like it in BindingDB:
Activity Spreadsheet -- Enzyme Inhibition Constant Data from BindingDB
Found 3 hits for monomerid = 50459401
TargetVasopressin V1a receptor(Homo sapiens (Human))
Umr7200 Cnrs/Universit£
Curated by ChEMBL
LigandPNGBDBM50459401(CHEMBL4210854)
Affinity DataKi:  2.30nM. Assay description: Displacement of [3H]-AVP from human V1A receptor expressed in CHO cell membranes by radioligand binding assay
Ligand InfoPC cidPC sid
In DepthDetails ArticlePubMed
TargetOxytocin receptor(Homo sapiens (Human))
Umr7200 Cnrs/Universit£
Curated by ChEMBL
LigandPNGBDBM50459401(CHEMBL4210854)
Affinity DataKi:  10nM. Assay description: Displacement of [3H]-AVP from human OXR receptor expressed in CHO cell membranes by radioligand binding assay
Ligand InfoPC cidPC sid
In DepthDetails ArticlePubMed
TargetVasopressin V2 receptor(Homo sapiens (Human))
Umr7200 Cnrs/Universit£
Curated by ChEMBL
LigandPNGBDBM50459401(CHEMBL4210854)
Affinity DataKi:  78nM. Assay description: Displacement of [3H]-AVP from human V2 receptor expressed in CHO cell membranes by radioligand binding assay
Ligand InfoPC cidPC sid
In DepthDetails ArticlePubMed