BDBM50459655 CHEMBL4210514
SMILES CC[C@H](C)[C@@H]1NC(=O)[C@@H]2CCCN2C(=O)[C@H](CO)NC(=O)[C@H](CCSC)NC(=O)[C@H](C)NC(=O)[C@H](CCCNC(N)=N)NC(=O)[C@@H]2CSSC[C@H](NC(=O)CN)C(=O)N[C@@H](CSSC[C@H](NC1=O)C(N)=O)C(=O)N[C@@H](CO)C(=O)N[C@@H](Cc1cnc[nH]1)C(=O)N1CCC[C@H]1C(=O)N[C@@H](C(C)C)C(=O)N2
InChI Key InChIKey=OKMNJCSWWXNIJM-OIDKVKGJSA-N
Data  2 IC50
  Tab Delimited (TSV)   2D SDfile   Computed 3D by Vconf -m prep SDfile
Find this compound or compounds like it in BindingDB:
Activity Spreadsheet -- Enzyme Inhibition Constant Data from BindingDB
Found 2 hits for monomerid = 50459655
TargetNeuronal acetylcholine receptor subunit alpha-3/beta-4(Rattus norvegicus (Rat))
Hainan University
Curated by ChEMBL
LigandPNGBDBM50459655(CHEMBL4210514)
Affinity DataIC50:  5.40nM. Assay description: Antagonist activity at rat alpha3beta4 nACHR expressed in Xenopus laevis oocytes assessed as inhibition of acetyl choline-induced membrane currents p...
Ligand InfoPC cidPC sid
In DepthDetails ArticlePubMed
TargetNeuronal acetylcholine receptor subunit alpha-3/alpha-6/beta-4(Rattus norvegicus (Rat))
Hainan University
Curated by ChEMBL
LigandPNGBDBM50459655(CHEMBL4210514)
Affinity DataIC50:  350nM. Assay description: Antagonist activity at rat alpha6/alpha3beta4 nAChR nACHR expressed in Xenopus laevis oocytes assessed as inhibition of acetyl choline-induced membra...
Ligand InfoPC cidPC sid
In DepthDetails ArticlePubMed