BDBM50459738 CHEMBL4209820
SMILES CC[C@H](C)[C@H](NC(=O)[C@@H]1CCCN1C(=O)[C@H](CC(C)C)NC(C)=O)C(=O)N[C@@H](CO)C(=O)N[C@@H]([C@@H](C)CC)C(=O)N1CCC[C@H]1C(=O)N[C@@H](CC(C)C)C(=O)N[C@@H](CO)C(=O)N[C@@H]([C@@H](C)O)C(=O)N[C@@H](C(C)C)C(N)=O
InChI Key InChIKey=FPZHKUJVULNIRM-VETPPHEUSA-N
Data  2 KI  2 IC50
  Tab Delimited (TSV)   2D SDfile   Computed 3D by Vconf -m prep SDfile
Find this compound or compounds like it in BindingDB:
Activity Spreadsheet -- Enzyme Inhibition Constant Data from BindingDB
Found 4 hits for monomerid = 50459738
TargetProtein AF-9(Homo sapiens)
China Pharmaceutical University
Curated by ChEMBL
LigandPNGBDBM50459738(CHEMBL4209820)
Affinity DataKi:  20nM. Assay description: Displacement of N-Flu-DOT1L from MBP-tagged AF9 (unknown origin) (487 to 568 residues) expressed in Escherichia coli BL21(DE3) measured after 3 hrs b...
Ligand InfoPC cidPC sid
In DepthDetails ArticlePubMed
TargetProtein ENL(Homo sapiens)
China Pharmaceutical University
Curated by ChEMBL
LigandPNGBDBM50459738(CHEMBL4209820)
Affinity DataKi:  150nM. Assay description: Displacement of N-Flu-DOT1L from MBP-tagged ENL (unknown origin) (489 to 559 residues) expressed in Escherichia coli BL21(DE3) measured after 3 hrs b...
Ligand InfoPC cidPC sid
In DepthDetails ArticlePubMed
TargetProtein ENL(Homo sapiens)
China Pharmaceutical University
Curated by ChEMBL
LigandPNGBDBM50459738(CHEMBL4209820)
Affinity DataIC50:  630nM. Assay description: Displacement of N-Flu-DOT1L from MBP-tagged ENL (unknown origin) (489 to 559 residues) expressed in Escherichia coli BL21(DE3) measured after 3 hrs b...
Ligand InfoPC cidPC sid
In DepthDetails ArticlePubMed
TargetProtein AF-9(Homo sapiens)
China Pharmaceutical University
Curated by ChEMBL
LigandPNGBDBM50459738(CHEMBL4209820)
Affinity DataIC50:  140nM. Assay description: Displacement of N-Flu-DOT1L from MBP-tagged AF9 (unknown origin) (487 to 568 residues) expressed in Escherichia coli BL21(DE3) measured after 3 hrs b...
Ligand InfoPC cidPC sid
In DepthDetails ArticlePubMed