BDBM50461644 CHEMBL4228416
SMILES COc1ccc(cc1OC)C(=O)N1CC[C@@H](NC(=O)c2ccccc2Cl)[C@H](C1)c1ccccc1
InChI Key InChIKey=BJBRZZQBAKRNIU-FYYLOGMGSA-N
Data  1 IC50
  Tab Delimited (TSV)   2D SDfile   Computed 3D by Vconf -m prep SDfile
Find this compound or compounds like it in BindingDB:
Activity Spreadsheet -- Enzyme Inhibition Constant Data from BindingDB
Found 1 hit for monomerid = 50461644
TargetSerine palmitoyltransferase 2(Homo sapiens (Human))
Takeda Pharmaceutical
Curated by ChEMBL
LigandPNGBDBM50461644(CHEMBL4228416)
Affinity DataIC50:  0.360nM. Assay description: Inhibition of human SPT2 transfected in Freestyle293 cells using L-serine and palmitoyl-CoA as substrate preincubated for 60 mins followed by substra...
Ligand InfoPC cidPC sid
In DepthDetails ArticlePubMed