BDBM50461651 CHEMBL4226210
SMILES Fc1ccc(cc1)C(CCCNCCCN1CCCCC1)c1ccc(F)cc1
InChI Key InChIKey=YHDCQGYFBMAZSX-UHFFFAOYSA-N
Data  1 IC50
  Tab Delimited (TSV)   2D SDfile   Computed 3D by Vconf -m prep SDfile
Find this compound or compounds like it in BindingDB:
Activity Spreadsheet -- Enzyme Inhibition Constant Data from BindingDB
Found 1 hit for monomerid = 50461651
TargetSodium channel protein type 5 subunit alpha(Homo sapiens (Human))
University Of Alabama At Birmingham
Curated by ChEMBL
LigandPNGBDBM50461651(CHEMBL4226210)
Affinity DataIC50:  4.80E+3nM. Assay description: Inhibition of neonatal Nav1.5 in human MDA-MB-231 cells assessed as reduction in inward sodium peak current at -100 mV holding potential after 5 to 1...
In DepthDetails ArticlePubMed