BDBM50465602 CHEMBL4278618
SMILES CCOc1ccc(cc1CN(CC1CC1)C(=O)c1cccc(OC)c1)-c1cn2CCCc2n1
InChI Key InChIKey=LZJTUJUGRLHZQK-UHFFFAOYSA-N
Data  1 KI
  Tab Delimited (TSV)   2D SDfile   Computed 3D by Vconf -m prep SDfile
Find this compound or compounds like it in BindingDB:
Activity Spreadsheet -- Enzyme Inhibition Constant Data from BindingDB
Found 1 hit for monomerid = 50465602
TargetWD repeat-containing protein 5(Homo sapiens (Human))
TBA
Curated by ChEMBL
LigandPNGBDBM50465602(CHEMBL4278618)
Affinity DataKi:  43nM. Assay description: Binding affinity to N-terminal 6x-His-SUMO tagged WDR5 delta23 deletion mutant (24 to 334 residues) (unknown origin) expressed in Escherichia coli BL...
Ligand InfoPC cidPC sid
In DepthDetails ArticlePubMed