BDBM50469540 CHEMBL4294901
SMILES [#7]-[#6@H]-1-[#6][Se;v2][Se;v2][#6]-[#6@H](-[#7]-[#6](=O)-[#6@H](-[#6]-[#6](-[#7])=O)-[#7]-[#6](=O)-[#6@H](-[#6]-[#6]-[#6](-[#7])=O)-[#7]-[#6](=O)-[#6@H](-[#6]-c2ccccc2)-[#7]-[#6](=O)-[#6@H](-[#6]-c2ccc(-[#8])cc2)-[#7]-[#6]-1=O)-[#6](=O)-[#7]-1-[#6]-[#6]-[#6]-[#6@H]-1-[#6](=O)-[#7]-[#6@H](-[#6]-[#6]-[#6]-[#7]-[#6](-[#7])=[#7])-[#6](=O)-[#7]-[#6]-[#6](-[#7])=O
InChI Key InChIKey=PDAPSPXIBPNITO-FRPRKMAFSA-N
Data  2 KI  2 Kd
  Tab Delimited (TSV)   2D SDfile   Computed 3D by Vconf -m prep SDfile
Find this compound or compounds like it in BindingDB:
Activity Spreadsheet -- Enzyme Inhibition Constant Data from BindingDB
Found 4 hits for monomerid = 50469540
TargetVasopressin V1a receptor(Homo sapiens (Human))
University Of Montpellier
Curated by ChEMBL
LigandPNGBDBM50469540(CHEMBL4294901)
Affinity DataKi:  0.700nM. Assay description: Displacement of [125I]OH-Phpa-LVA from human V1A receptor expressed in CHO cells after 4 hrs by gamma counter analysis
Ligand InfoPC cidPC sid
In DepthDetails ArticlePubMed
TargetVasopressin V1a receptor(Homo sapiens (Human))
University Of Montpellier
Curated by ChEMBL
LigandPNGBDBM50469540(CHEMBL4294901)
Affinity DataKi:  1.70nM. Assay description: Displacement of [Se-Se]-AVP from human V1A receptor expressed in CHO cells after 4 hrs by RP-LC-ICPMS analysis
Ligand InfoPC cidPC sid
In DepthDetails ArticlePubMed
TargetVasopressin V1a receptor(Homo sapiens (Human))
University Of Montpellier
Curated by ChEMBL
LigandPNGBDBM50469540(CHEMBL4294901)
Affinity DataKd:  0.990nM. Assay description: Binding affinity to human V1A receptor expressed in CHO cells after 4 hrs by RP-LC-ICPMS analysis
Ligand InfoPC cidPC sid
In DepthDetails ArticlePubMed
TargetVasopressin V1a receptor(Homo sapiens (Human))
University Of Montpellier
Curated by ChEMBL
LigandPNGBDBM50469540(CHEMBL4294901)
Affinity DataKd:  0.600nM. Assay description: Binding affinity to human V1A receptor expressed in CHO cell membranes
Ligand InfoPC cidPC sid
In DepthDetails ArticlePubMed