BDBM50469617 CHEMBL4066167
SMILES Clc1ccc(cc1)-c1ccnc2[nH]cc(C#N)c12
InChI Key InChIKey=CFBSDXZYGNDXOR-UHFFFAOYSA-N
Data  1 KI  1 IC50
  Tab Delimited (TSV)   2D SDfile   Computed 3D by Vconf -m prep SDfile
Find this compound or compounds like it in BindingDB:
Activity Spreadsheet -- Enzyme Inhibition Constant Data from BindingDB
Found 2 hits for monomerid = 50469617
TargetLeucine-rich repeat serine/threonine-protein kinase 2(Homo sapiens (Human))
Vernalis (R&D)
Curated by ChEMBL
LigandPNGBDBM50469617(CHEMBL4066167)
Affinity DataKi:  136nM. Assay description: Inhibition of recombinant human GST-tagged LRRK2 G2019S mutant (970 to 2527 residues) expressed in baculovirus using fluorescein-LRRKtide as substrat...
Ligand InfoPC cidPC sid
In DepthDetails ArticlePubMed
TargetLeucine-rich repeat serine/threonine-protein kinase 2(Homo sapiens (Human))
Vernalis (R&D)
Curated by ChEMBL
LigandPNGBDBM50469617(CHEMBL4066167)
Affinity DataIC50:  1.98E+3nM. Assay description: Inhibition of recombinant human GST-tagged LRRK2 G2019S mutant (970 to 2527 residues) expressed in baculovirus using fluorescein-LRRKtide as substrat...
Ligand InfoPC cidPC sid
In DepthDetails ArticlePubMed