BDBM50469664 3-Decyl-Phenol::CHEMBL33202
SMILES CCCCCCCCCCc1cccc(O)c1
InChI Key InChIKey=HRMIBYZWBMSUHC-UHFFFAOYSA-N
Data  5 IC50
  Tab Delimited (TSV)   2D SDfile   Computed 3D by Vconf -m prep SDfile
Find this compound or compounds like it in BindingDB:
Activity Spreadsheet -- Enzyme Inhibition Constant Data from BindingDB
Found 5 hits for monomerid = 50469664
TargetBeta-lactamase(Escherichia coli)TBA
LigandPNGBDBM50469664(3-Decyl-Phenol | CHEMBL33202)
Affinity DataIC50:  1.74E+7nM. Assay description: Concentration required for its inhibitory activity against Escherichia coli K12(PSE4) class A beta-lactamase
Ligand InfoPC cidPC sid
In DepthDetails Article
TargetBeta-lactamase TEM(Escherichia coli)TBA
LigandPNGBDBM50469664(3-Decyl-Phenol | CHEMBL33202)
Affinity DataIC50:  8.10E+6nM. Assay description: Concentration required for its inhibitory activity against Escherichia coli JT4(TEM1) class A beta-lactamase
Ligand InfoPC cidPC sid
In DepthDetails Article
TargetBeta-lactamase OXA-1(Escherichia coli (Enterobacteria))TBA
LigandPNGBDBM50469664(3-Decyl-Phenol | CHEMBL33202)
Affinity DataIC50: >1.40E+8nM. Assay description: Concentration required for its inhibitory activity against Escherichia coli K12(OXA1) class D beta-lactamase
Ligand InfoPC cidPC sid
In DepthDetails Article
TargetBeta-lactamase(Enterobacter cloacae)TBA
LigandPNGBDBM50469664(3-Decyl-Phenol | CHEMBL33202)
Affinity DataIC50:  1.91E+7nM. Assay description: Concentration required for its inhibitory activity against Enterobacter cloacae P99 class C beta-lactamase
Ligand InfoPC cidPC sid
In DepthDetails Article
TargetBeta-lactamase(Pseudomonas aeruginosa (PAO1))TBA
LigandPNGBDBM50469664(3-Decyl-Phenol | CHEMBL33202)
Affinity DataIC50:  1.36E+8nM. Assay description: Concentration required for its inhibitory activity against Pseudomonas aeruginosa class C beta-lactamase
Ligand InfoPC cidPC sid
In DepthDetails Article