BDBM50471159 CHEMBL302914
SMILES [#6]-c1cc(-[#8]-c2ccccc2Cl)c(cc1-[#6](=O)\[#7]=[#6](/[#7])-[#7])S([#6])(=O)=O
InChI Key InChIKey=BAAJGTCBJJQMMD-UHFFFAOYSA-N
Data  1 IC50
  Tab Delimited (TSV)   2D SDfile   Computed 3D by Vconf -m prep SDfile
Find this compound or compounds like it in BindingDB:
Activity Spreadsheet -- Enzyme Inhibition Constant Data from BindingDB
Found 1 hit for monomerid = 50471159
TargetSodium/hydrogen exchanger 3(Oryctolagus cuniculus)
Merck
Curated by ChEMBL
LigandPNGBDBM50471159(CHEMBL302914)
Affinity DataIC50:  14nM. Assay description: Inhibition of 5-N-(ethyl isopropyl)-amiloride[EIPA]-sensitive Na+ uptake into acidified rabbit erythrocytes.
Ligand InfoPC cidPC sid
In DepthDetails ArticlePubMed