BDBM50471196 CHEMBL292105
SMILES [#6]-[#6]-[#6]-[#16]-c1cc(-[#6])c(cc1S([#6])(=O)=O)-[#6](=O)\[#7]=[#6](/[#7])-[#7]
InChI Key InChIKey=CLMUAEHJTRTAJE-UHFFFAOYSA-N
Data  1 IC50
  Tab Delimited (TSV)   2D SDfile   Computed 3D by Vconf -m prep SDfile
Find this compound or compounds like it in BindingDB:
Activity Spreadsheet -- Enzyme Inhibition Constant Data from BindingDB
Found 1 hit for monomerid = 50471196
TargetSodium/hydrogen exchanger 3(Oryctolagus cuniculus)
Merck
Curated by ChEMBL
LigandPNGBDBM50471196(CHEMBL292105)
Affinity DataIC50:  6.80nM. Assay description: Inhibition of 5-N-(ethyl isopropyl)-amiloride[EIPA]-sensitive Na+ uptake into acidified rabbit erythrocytes.
Ligand InfoPC cidPC sid
In DepthDetails ArticlePubMed