BDBM50471223 CHEMBL64516
SMILES [#6]-c1cc(-[#6]-2-[#6]-[#6]-[#6]-[#6]-[#6]-2)c(cc1-[#6](=O)\[#7]=[#6](/[#7])-[#7])S([#6])(=O)=O
InChI Key InChIKey=RODYRLUZOOANCG-UHFFFAOYSA-N
Data  1 IC50
  Tab Delimited (TSV)   2D SDfile   Computed 3D by Vconf -m prep SDfile
Find this compound or compounds like it in BindingDB:
Activity Spreadsheet -- Enzyme Inhibition Constant Data from BindingDB
Found 1 hit for monomerid = 50471223
TargetSodium/hydrogen exchanger 3(Oryctolagus cuniculus)
Merck
Curated by ChEMBL
LigandPNGBDBM50471223(CHEMBL64516)
Affinity DataIC50:  22nM. Assay description: Inhibition of 5-N-(ethyl isopropyl)-amiloride[EIPA]-sensitive Na+ uptake into acidified rabbit erythrocytes.
Ligand InfoPC cidPC sid
In DepthDetails ArticlePubMed