BDBM50471959 CHEMBL146301
SMILES Cc1sc(nc1CCOc1ccc(C[C@H](Nc2ccccc2C(=O)c2ccccc2)C(O)=O)cc1)N1CCN(CC1)C(=O)OC(C)(C)C
InChI Key InChIKey=BONFKPKTJNBVIB-YTTGMZPUSA-N
Data  2 KI  3 EC50
  Tab Delimited (TSV)   2D SDfile   Computed 3D by Vconf -m prep SDfile
Find this compound or compounds like it in BindingDB:
Activity Spreadsheet -- Enzyme Inhibition Constant Data from BindingDB
Found 5 hits for monomerid = 50471959
TargetPeroxisome proliferator-activated receptor gamma(Homo sapiens (Human))
Glaxo Wellcome Research And Development
Curated by ChEMBL
LigandPNGBDBM50471959(CHEMBL146301)
Affinity DataKi:  0.977nM. Assay description: Inhibition by 50% of in vitro binding to Peroxisome proliferator activated receptor gamma
Ligand InfoPC cidPC sid
In DepthDetails ArticlePubMed
TargetPeroxisome proliferator-activated receptor alpha(Homo sapiens (Human))
Glaxo Wellcome Research And Development
Curated by ChEMBL
LigandPNGBDBM50471959(CHEMBL146301)
Affinity DataKi: <3.02E+3nM. Assay description: Tested in vitro for inhibiting the 50% binding of Peroxisome proliferator activated receptor alpha
Ligand InfoPC cidPC sid
In DepthDetails ArticlePubMed
TargetPeroxisome proliferator-activated receptor gamma(Homo sapiens (Human))
Glaxo Wellcome Research And Development
Curated by ChEMBL
LigandPNGBDBM50471959(CHEMBL146301)
Affinity DataEC50:  40nM. Assay description: Ability to promote differentiation of C3H10T1/2 stem cells to adipocytes using lipogenesis assay mediated through activation of Peroxisome proliferat...
Ligand InfoPC cidPC sid
In DepthDetails ArticlePubMed
TargetPeroxisome proliferator-activated receptor gamma(Homo sapiens (Human))
Glaxo Wellcome Research And Development
Curated by ChEMBL
LigandPNGBDBM50471959(CHEMBL146301)
Affinity DataEC50:  2.40nM. Assay description: Tested functionally in vitro for inducing 50% of the maximum alkaline phosphate activity (Transactivation) against Peroxisome proliferator activated ...
Ligand InfoPC cidPC sid
In DepthDetails ArticlePubMed
TargetPeroxisome proliferator-activated receptor alpha(Homo sapiens (Human))
Glaxo Wellcome Research And Development
Curated by ChEMBL
LigandPNGBDBM50471959(CHEMBL146301)
Affinity DataEC50: <1.00E+4nM. Assay description: In vitro transactivation of Peroxisome proliferator activated receptor alpha.
Ligand InfoPC cidPC sid
In DepthDetails ArticlePubMed