BDBM50471982 CHEMBL147384
SMILES Cc1oc(nc1CCOc1ccc(C[C@H](Nc2ccccc2C(=O)c2ccccc2)C(O)=O)cc1)-c1ccc(F)cc1
InChI Key InChIKey=QTRNCEZOJHHDGS-HKBQPEDESA-N
Data  2 KI  5 EC50
  Tab Delimited (TSV)   2D SDfile   Computed 3D by Vconf -m prep SDfile
Find this compound or compounds like it in BindingDB:
Activity Spreadsheet -- Enzyme Inhibition Constant Data from BindingDB
Found 7 hits for monomerid = 50471982
TargetPeroxisome proliferator-activated receptor gamma(Homo sapiens (Human))
Glaxo Wellcome Research And Development
Curated by ChEMBL
LigandPNGBDBM50471982(CHEMBL147384)
Affinity DataKi:  1.60nM. Assay description: Inhibition by 50% of in vitro binding to Peroxisome proliferator activated receptor gamma
Ligand InfoPC cidPC sid
In DepthDetails ArticlePubMed
TargetPeroxisome proliferator-activated receptor alpha(Homo sapiens (Human))
Glaxo Wellcome Research And Development
Curated by ChEMBL
LigandPNGBDBM50471982(CHEMBL147384)
Affinity DataKi:  56nM. Assay description: Tested in vitro for inhibiting the 50% binding of Peroxisome proliferator activated receptor alpha
Ligand InfoPC cidPC sid
In DepthDetails ArticlePubMed
TargetPeroxisome proliferator-activated receptor gamma(Homo sapiens (Human))
Glaxo Wellcome Research And Development
Curated by ChEMBL
LigandPNGBDBM50471982(CHEMBL147384)
Affinity DataEC50:  1.5nM. Assay description: Ability to promote differentiation of C3H10T1/2 stem cells to adipocytes using lipogenesis assay mediated through activation of Peroxisome proliferat...
Ligand InfoPC cidPC sid
In DepthDetails ArticlePubMed
TargetPeroxisome proliferator-activated receptor gamma(Homo sapiens (Human))
Glaxo Wellcome Research And Development
Curated by ChEMBL
LigandPNGBDBM50471982(CHEMBL147384)
Affinity DataEC50:  0.126nM. Assay description: Tested functionally in vitro for inducing 50% of the maximum alkaline phosphate activity (Transactivation) against Peroxisome proliferator activated ...
Ligand InfoPC cidPC sid
In DepthDetails ArticlePubMed
TargetPeroxisome proliferator-activated receptor alpha(Homo sapiens (Human))
Glaxo Wellcome Research And Development
Curated by ChEMBL
LigandPNGBDBM50471982(CHEMBL147384)
Affinity DataEC50:  257nM. Assay description: Transactivation of Homo sapiens (human) PPARalpha assessed as luciferase activity by reporter gene assay
Ligand InfoPC cidPC sid
In DepthDetails Article
TargetPeroxisome proliferator-activated receptor gamma(Homo sapiens (Human))
Glaxo Wellcome Research And Development
Curated by ChEMBL
LigandPNGBDBM50471982(CHEMBL147384)
Affinity DataEC50:  0.126nM. Assay description: Transactivation of Homo sapiens (human) PPARgamma assessed as luciferase activity by reporter gene assay
Ligand InfoPC cidPC sid
In DepthDetails Article
TargetPeroxisome proliferator-activated receptor alpha(Homo sapiens (Human))
Glaxo Wellcome Research And Development
Curated by ChEMBL
LigandPNGBDBM50471982(CHEMBL147384)
Affinity DataEC50:  257nM. Assay description: In vitro transactivation of Peroxisome proliferator activated receptor alpha.
Ligand InfoPC cidPC sid
In DepthDetails ArticlePubMed