BDBM50472019 CHEMBL148668
SMILES CC(C)OC(=O)c1ccccc1NC(Cc1ccc(OCCc2nc(oc2C)-c2ccccc2)cc1)C(O)=O
InChI Key InChIKey=KLDMJDLANANFFR-UHFFFAOYSA-N
Data  1 KI  2 EC50
  Tab Delimited (TSV)   2D SDfile   Computed 3D by Vconf -m prep SDfile
Find this compound or compounds like it in BindingDB:
Activity Spreadsheet -- Enzyme Inhibition Constant Data from BindingDB
Found 3 hits for monomerid = 50472019
TargetPeroxisome proliferator-activated receptor gamma(Homo sapiens (Human))
Glaxo Wellcome Research And Development
Curated by ChEMBL
LigandPNGBDBM50472019(CHEMBL148668)
Affinity DataKi:  0.977nM. Assay description: Binding affinity against peroxisome proliferator activated receptor gamma (PPAR-gamma)
Ligand InfoPC cidPC sid
In DepthDetails ArticlePubMed
TargetPeroxisome proliferator-activated receptor gamma(Homo sapiens (Human))
Glaxo Wellcome Research And Development
Curated by ChEMBL
LigandPNGBDBM50472019(CHEMBL148668)
Affinity DataEC50:  3.20nM. Assay description: -log concentration required to induce 50% maximum lipogenic activity against Peroxisome proliferator activated receptor gamma
Ligand InfoPC cidPC sid
In DepthDetails ArticlePubMed
TargetPeroxisome proliferator-activated receptor gamma(Homo sapiens (Human))
Glaxo Wellcome Research And Development
Curated by ChEMBL
LigandPNGBDBM50472019(CHEMBL148668)
Affinity DataEC50:  0.575nM. Assay description: in vitro agonist activity against peroxisome proliferator activated receptor-gamma (PPAR-gamma), using alkaline phosphatase activity transactivator a...
Ligand InfoPC cidPC sid
In DepthDetails ArticlePubMed