BDBM50472029 CHEMBL149780
SMILES CN(CCOc1ccc(CC(Nc2cscc2C(=O)c2ccccc2)C(O)=O)cc1)c1nc2ccccc2o1
InChI Key InChIKey=UCXZPJVOWPMUFS-UHFFFAOYSA-N
Data  1 KI  2 EC50
  Tab Delimited (TSV)   2D SDfile   Computed 3D by Vconf -m prep SDfile
Find this compound or compounds like it in BindingDB:
Activity Spreadsheet -- Enzyme Inhibition Constant Data from BindingDB
Found 3 hits for monomerid = 50472029
TargetPeroxisome proliferator-activated receptor gamma(Homo sapiens (Human))
Glaxo Wellcome Research And Development
Curated by ChEMBL
LigandPNGBDBM50472029(CHEMBL149780)
Affinity DataKi:  2.60nM. Assay description: Binding affinity against peroxisome proliferator activated receptor gamma (PPAR-gamma)
Ligand InfoPC cidPC sid
In DepthDetails ArticlePubMed
TargetPeroxisome proliferator-activated receptor gamma(Homo sapiens (Human))
Glaxo Wellcome Research And Development
Curated by ChEMBL
LigandPNGBDBM50472029(CHEMBL149780)
Affinity DataEC50:  1.40nM. Assay description: -log concentration required to induce 50% maximum lipogenic activity against Peroxisome proliferator activated receptor gamma
Ligand InfoPC cidPC sid
In DepthDetails ArticlePubMed
TargetPeroxisome proliferator-activated receptor gamma(Homo sapiens (Human))
Glaxo Wellcome Research And Development
Curated by ChEMBL
LigandPNGBDBM50472029(CHEMBL149780)
Affinity DataEC50:  8.30nM. Assay description: in vitro agonist activity against peroxisome proliferator activated receptor-gamma (PPAR-gamma), using alkaline phosphatase activity transactivator a...
Ligand InfoPC cidPC sid
In DepthDetails ArticlePubMed