BDBM50472033 CHEMBL347788
SMILES Cc1oc(nc1CCOc1ccc(CC(Nc2ccccc2C(=O)c2cccc(N)c2)C(O)=O)cc1)-c1ccccc1
InChI Key InChIKey=XTHZFZNFGAGHCA-UHFFFAOYSA-N
Data  1 KI  2 EC50
  Tab Delimited (TSV)   2D SDfile   Computed 3D by Vconf -m prep SDfile
Find this compound or compounds like it in BindingDB:
Activity Spreadsheet -- Enzyme Inhibition Constant Data from BindingDB
Found 3 hits for monomerid = 50472033
TargetPeroxisome proliferator-activated receptor gamma(Homo sapiens (Human))
Glaxo Wellcome Research And Development
Curated by ChEMBL
LigandPNGBDBM50472033(CHEMBL347788)
Affinity DataKi:  3.20nM. Assay description: Binding affinity against peroxisome proliferator activated receptor gamma (PPAR-gamma)
Ligand InfoPC cidPC sid
In DepthDetails ArticlePubMed
TargetPeroxisome proliferator-activated receptor gamma(Homo sapiens (Human))
Glaxo Wellcome Research And Development
Curated by ChEMBL
LigandPNGBDBM50472033(CHEMBL347788)
Affinity DataEC50:  132nM. Assay description: -log concentration required to induce 50% maximum lipogenic activity against Peroxisome proliferator activated receptor gamma
Ligand InfoPC cidPC sid
In DepthDetails ArticlePubMed
TargetPeroxisome proliferator-activated receptor gamma(Homo sapiens (Human))
Glaxo Wellcome Research And Development
Curated by ChEMBL
LigandPNGBDBM50472033(CHEMBL347788)
Affinity DataEC50:  8.90nM. Assay description: in vitro agonist activity against peroxisome proliferator activated receptor-gamma (PPAR-gamma), using alkaline phosphatase activity transactivator a...
Ligand InfoPC cidPC sid
In DepthDetails ArticlePubMed