BDBM50473844 CHEMBL123254
SMILES CCCCC\C=C/C\C=C/C\C=C/C\C=C/CCCC(=O)NCc1ccc(O)c(OC)c1
InChI Key InChIKey=QVLMCRFQGHWOPM-ZKWNWVNESA-N
Data  2 EC50
  Tab Delimited (TSV)   2D SDfile   Computed 3D by Vconf -m prep SDfile
Find this compound or compounds like it in BindingDB:
Activity Spreadsheet -- Enzyme Inhibition Constant Data from BindingDB
Found 2 hits for monomerid = 50473844
TargetTransient receptor potential cation channel subfamily V member 1(Rattus norvegicus (rat))
Lund University
Curated by ChEMBL
LigandPNGBDBM50473844(CHEMBL123254)
Affinity DataEC50:  0.501nM. Assay description: Agonist activity at TRPV1 in rat isolated mesenteric arteries assessed as vasorelaxation of phenylephrine-induced contraction
In DepthDetails ArticlePubMed
TargetTransient receptor potential cation channel subfamily V member 1(Homo sapiens (Human))
Istituto Per La Chimica Di Molecole Di Interesse Biologico
Curated by ChEMBL
LigandPNGBDBM50473844(CHEMBL123254)
Affinity DataEC50:  0.501nM. Assay description: Concentration necessary to induce a relative half-maximal response measured by the entry of [Ca2+] into human embryonic kidney HEK293 cells overexpre...
In DepthDetails ArticlePubMed