BDBM50474792 CHEMBL63200
SMILES Oc1ccc2[nH]c(Cc3ccc(Oc4ccccc4)cc3)nc2c1
InChI Key InChIKey=LVCCXJOSNNQODU-UHFFFAOYSA-N
Data  1 KI  2 IC50
  Tab Delimited (TSV)   2D SDfile   Computed 3D by Vconf -m prep SDfile
Find this compound or compounds like it in BindingDB:
Activity Spreadsheet -- Enzyme Inhibition Constant Data from BindingDB
Found 3 hits for monomerid = 50474792
TargetGlutamate receptor ionotropic, NMDA 1/2B(Homo sapiens (Human))
Merck Research Laboratories
Curated by ChEMBL
LigandPNGBDBM50474792(CHEMBL63200)
Affinity DataKi:  3.20nM. Assay description: Compound was evaluated for in vitro inhibition of [3H][(E)-N-(2-methoxybenzyl)cinnamamidine binding to human NR1a/NR2B receptors expressed in LtK-cel...
Ligand InfoPC cidPC sid
In DepthDetails ArticlePubMed
TargetGlutamate receptor ionotropic, NMDA 1/2B(Homo sapiens (Human))
Merck Research Laboratories
Curated by ChEMBL
LigandPNGBDBM50474792(CHEMBL63200)
Affinity DataIC50:  9.20nM. Assay description: In vitro inhibition of Glu/Gly stimulated [Ca2+] influx in LtK-cells expressing the hNR1a/NR2B receptor
Ligand InfoPC cidPC sid
In DepthDetails ArticlePubMed
TargetAlpha-1A/Alpha-1B/Alpha-1D adrenergic receptor(Rattus norvegicus (rat))
Merck Research Laboratories
Curated by ChEMBL
LigandPNGBDBM50474792(CHEMBL63200)
Affinity DataIC50:  200nM. Assay description: In vitro inhibitory activity against alpha-1 adrenergic receptor binding to rat brain membranes
Ligand InfoPC cidPC sid
In DepthDetails ArticlePubMed