BDBM50476602 CHEMBL242366
SMILES CN(CCc1ccccc1)C(=O)Cc1ccc(OCCCCOc2ccc(CC(O)=O)cc2)cc1
InChI Key InChIKey=SWQGZTQCRRDOMA-UHFFFAOYSA-N
Data  1 IC50
  Tab Delimited (TSV)   2D SDfile   Computed 3D by Vconf -m prep SDfile
Find this compound or compounds like it in BindingDB:
Activity Spreadsheet -- Enzyme Inhibition Constant Data from BindingDB
Found 1 hit for monomerid = 50476602
TargetLeukotriene B4 receptor 2(Homo sapiens (Human))
Zentiva Vufb
Curated by ChEMBL
LigandPNGBDBM50476602(CHEMBL242366)
Affinity DataIC50:  4.70E+3nM. Assay description: Displacement of [3H]LTB4 from LTB4 receptor in guinea pig spleen membrane
Ligand InfoKEGGPC cidPC sid
In DepthDetails ArticlePubMed