BDBM50476830 CHEMBL442235
SMILES Cn1cc(C(N)=O)c(Nc2ccc(I)cc2F)cc1=O
InChI Key InChIKey=PJMVKCSXHOGMAD-UHFFFAOYSA-N
Data  2 IC50
  Tab Delimited (TSV)   2D SDfile   Computed 3D by Vconf -m prep SDfile
Find this compound or compounds like it in BindingDB:
Activity Spreadsheet -- Enzyme Inhibition Constant Data from BindingDB
Found 2 hits for monomerid = 50476830
TargetDual specificity mitogen-activated protein kinase kinase 1/2(Homo sapiens (Human))
University Of Auckland
Curated by ChEMBL
LigandPNGBDBM50476830(CHEMBL442235)
Affinity DataIC50:  4nM. Assay description: Inhibition of MEK in mouse colon 26 carcinoma cells assessed as inhibition of ERK phosphorylation by ELISA
Ligand InfoPC cidPC sid
In DepthDetails ArticlePubMed
TargetDual specificity mitogen-activated protein kinase kinase 1/2(Homo sapiens (Human))
University Of Auckland
Curated by ChEMBL
LigandPNGBDBM50476830(CHEMBL442235)
Affinity DataIC50:  23nM. Assay description: Inhibition of MEK assessed as inhibition of ERK phosphorylation by Raf-MEK-ERK cascade assay
Ligand InfoPC cidPC sid
In DepthDetails ArticlePubMed