BDBM50476902 CHEMBL231981
SMILES CC(C)(CC(O)=O)C#Cc1ccc(NC(=O)CSc2nnnn2-c2ccc(cc2Cl)C2CC2)c(Cl)c1
InChI Key InChIKey=RWKNTTWVISWZLP-UHFFFAOYSA-N
Data  1 IC50
  Tab Delimited (TSV)   2D SDfile   Computed 3D by Vconf -m prep SDfile
Find this compound or compounds like it in BindingDB:
Activity Spreadsheet -- Enzyme Inhibition Constant Data from BindingDB
Found 1 hit for monomerid = 50476902
TargetReverse transcriptase protein(Human immunodeficiency virus 1)
Boehringer Ingelheim (Canada)
Curated by ChEMBL
LigandPNGBDBM50476902(CHEMBL231981)
Affinity DataIC50:  26nM. Assay description: Inhibition of HIV1 reverse transcriptase K103N/Y181C mutant by scintillation proximity assay
Ligand InfoPC cidPC sid
In DepthDetails ArticlePubMed