BDBM50477275 CHEMBL391369
SMILES CC(Cl)(Cl)C(N\C(Nc1ccc(Cl)nc1)=N\C#N)NC(=O)c1ccc(Br)cc1
InChI Key InChIKey=NNTNBYRPLFTPRX-UHFFFAOYSA-N
Data  1 EC50
  Tab Delimited (TSV)   2D SDfile   Computed 3D by Vconf -m prep SDfile
Find this compound or compounds like it in BindingDB:
Activity Spreadsheet -- Enzyme Inhibition Constant Data from BindingDB
Found 1 hit for monomerid = 50477275
TargetATP-sensitive inward rectifier potassium channel 11(Homo sapiens (Human))
Abbott Laboratories
Curated by ChEMBL
LigandPNGBDBM50477275(CHEMBL391369)
Affinity DataEC50:  537nM. Assay description: Channel opening activity at human bladder Kir6.2 channel containing SUR2B expressed in L cells by FLIPR assay
Ligand InfoPC cidPC sid
In DepthDetails ArticlePubMed