BDBM50478058 CHEMBL429938
SMILES CC1(C)CCNC(=O)C(C1)N(Cc1ccc(cc1)C(=O)NC1CC1)S(=O)(=O)c1ccc(Cl)cc1
InChI Key InChIKey=UJHRYCHNFLBUEJ-UHFFFAOYSA-N
Data  1 IC50
  Tab Delimited (TSV)   2D SDfile   Computed 3D by Vconf -m prep SDfile
Find this compound or compounds like it in BindingDB:
Activity Spreadsheet -- Enzyme Inhibition Constant Data from BindingDB
Found 1 hit for monomerid = 50478058
TargetPresenilin-1(Homo sapiens (Human))
F. Hoffmann-La Roche
Curated by ChEMBL
LigandPNGBDBM50478058(CHEMBL429938)
Affinity DataIC50:  6nM. Assay description: Inhibition of human gamma secretase in HEK293 cells assessed as reduction of amyloid beta level by ELISA
Ligand InfoPC cidPC sid
In DepthDetails ArticlePubMed