BDBM50478086 CHEMBL261682
SMILES Brc1ccc(C(=O)N2CCCCC2)c(NS(=O)(=O)c2cccc3nccnc23)c1
InChI Key InChIKey=ACSGDPPWRUXBPD-UHFFFAOYSA-N
Data  2 KI
  Tab Delimited (TSV)   2D SDfile   Computed 3D by Vconf -m prep SDfile
Find this compound or compounds like it in BindingDB:
Activity Spreadsheet -- Enzyme Inhibition Constant Data from BindingDB
Found 2 hits for monomerid = 50478086
TargetGastrin/cholecystokinin type B receptor(Homo sapiens (Human))
Johnson & Johnson Pharmaceutical Research And Development
Curated by ChEMBL
LigandPNGBDBM50478086(CHEMBL261682)
Affinity DataKi:  63nM. Assay description: Displacement of [125I]CCK8S from human CCK2R
Ligand InfoPC cidPC sid
In DepthDetails ArticlePubMed
TargetCholecystokinin receptor type A(Homo sapiens (Human))
Johnson & Johnson Pharmaceutical Research And Development
Curated by ChEMBL
LigandPNGBDBM50478086(CHEMBL261682)
Affinity DataKi: <1.00E+4nM. Assay description: Displacement of [125I]CCK8S from human CCK1R
Ligand InfoPC cidPC sid
In DepthDetails ArticlePubMed