BDBM50478139 CHEMBL437457
SMILES CCOc1ccc(C[C@H](NC(=O)c2cccc(N)c2Cl)[C@H](O)C(=O)N2CCC(C)(C)[C@H]2C(=O)NCc2c(C)cccc2C)cc1
InChI Key InChIKey=AORYKNYADRTLFB-LHGWWSMPSA-N
Data  1 KI
  Tab Delimited (TSV)   2D SDfile   Computed 3D by Vconf -m prep SDfile
Find this compound or compounds like it in BindingDB:
Activity Spreadsheet -- Enzyme Inhibition Constant Data from BindingDB
Found 1 hit for monomerid = 50478139
TargetProtease(Human immunodeficiency virus 1 (HIV-1))
Dainippon Sumitomo Pharma
Curated by ChEMBL
LigandPNGBDBM50478139(CHEMBL437457)
Affinity DataKi:  0.861nM. Assay description: Inhibition of HIV1 protease
Ligand InfoPC cidPC sid
In DepthDetails ArticlePubMed