BDBM50481043 CHEMBL583660
SMILES Fc1ccc(cc1)S(=O)(=O)N1C(C2CC2)c2c[nH]nc2-c2ccccc12
InChI Key InChIKey=MAZVAJBBINZFPI-UHFFFAOYSA-N
Data  1 IC50
  Tab Delimited (TSV)   2D SDfile   Computed 3D by Vconf -m prep SDfile
Find this compound or compounds like it in BindingDB:
Activity Spreadsheet -- Enzyme Inhibition Constant Data from BindingDB
Found 1 hit for monomerid = 50481043
TargetPresenilin-1(Homo sapiens (Human))
Elan Pharmaceuticals
Curated by ChEMBL
LigandPNGBDBM50481043(CHEMBL583660)
Affinity DataIC50:  0.420nM. Assay description: Inhibition of Gamma-secretase in human IMR-32 cells after 2 hrs by ELISA assay
Ligand InfoPC cidPC sid
In DepthDetails ArticlePubMed