BDBM50481063 CHEMBL583662
SMILES FC(F)(F)c1ccc(cc1)S(=O)(=O)N1C(C2CC2)c2c[nH]nc2-c2ccc(cc12)-n1ccnc1
InChI Key InChIKey=JPVHYVFLHXZEDM-UHFFFAOYSA-N
Data  1 IC50
  Tab Delimited (TSV)   2D SDfile   Computed 3D by Vconf -m prep SDfile
Find this compound or compounds like it in BindingDB:
Activity Spreadsheet -- Enzyme Inhibition Constant Data from BindingDB
Found 1 hit for monomerid = 50481063
TargetPresenilin-1(Homo sapiens (Human))
Elan Pharmaceuticals
Curated by ChEMBL
LigandPNGBDBM50481063(CHEMBL583662)
Affinity DataIC50:  0.240nM. Assay description: Inhibition of Gamma-secretase in human IMR-32 cells after 2 hrs by ELISA assay
Ligand InfoPC cidPC sid
In DepthDetails ArticlePubMed