BDBM50481066 CHEMBL571807
SMILES CC1N(c2cc(F)ccc2-c2n[nH]cc12)S(=O)(=O)c1ccc(Cl)cc1
InChI Key InChIKey=HMNZAMWLAKXYLG-UHFFFAOYSA-N
Data  1 IC50
  Tab Delimited (TSV)   2D SDfile   Computed 3D by Vconf -m prep SDfile
Find this compound or compounds like it in BindingDB:
Activity Spreadsheet -- Enzyme Inhibition Constant Data from BindingDB
Found 1 hit for monomerid = 50481066
TargetPresenilin-1(Homo sapiens (Human))
Elan Pharmaceuticals
Curated by ChEMBL
LigandPNGBDBM50481066(CHEMBL571807)
Affinity DataIC50:  2.10nM. Assay description: Inhibition of Gamma-secretase in human IMR-32 cells after 2 hrs by ELISA assay
Ligand InfoPC cidPC sid
In DepthDetails ArticlePubMed