BDBM50481070 CHEMBL571591
SMILES CCC1N(c2ccccc2-c2n[nH]cc12)S(=O)(=O)c1ccc(Cl)cc1
InChI Key InChIKey=KJQPRNCOTYTPSD-UHFFFAOYSA-N
Data  1 IC50
  Tab Delimited (TSV)   2D SDfile   Computed 3D by Vconf -m prep SDfile
Find this compound or compounds like it in BindingDB:
Activity Spreadsheet -- Enzyme Inhibition Constant Data from BindingDB
Found 1 hit for monomerid = 50481070
TargetPresenilin-1(Homo sapiens (Human))
Elan Pharmaceuticals
Curated by ChEMBL
LigandPNGBDBM50481070(CHEMBL571591)
Affinity DataIC50:  0.360nM. Assay description: Inhibition of Gamma-secretase in human IMR-32 cells after 2 hrs by ELISA assay
Ligand InfoPC cidPC sid
In DepthDetails ArticlePubMed