BDBM50485402 CHEMBL2057882
SMILES Cc1ccc(NCc2cn(nc2-c2ccc(Cl)cc2)-c2ccccc2)cc1
InChI Key InChIKey=JFCSTFWUQJKVQW-UHFFFAOYSA-N
Data  1 IC50
  Tab Delimited (TSV)   2D SDfile   Computed 3D by Vconf -m prep SDfile
Find this compound or compounds like it in BindingDB:
Activity Spreadsheet -- Enzyme Inhibition Constant Data from BindingDB
Found 1 hit for monomerid = 50485402
TargetCyclin-dependent kinase 2/G1/S-specific cyclin-E1(Homo sapiens (Human))
Changzhou University
Curated by ChEMBL
LigandPNGBDBM50485402(CHEMBL2057882)
Affinity DataIC50:  2.08E+3nM. Assay description: Inhibition of CDK2/cyclin E
Ligand InfoPC cidPC sid
In DepthDetails ArticlePubMed